{"text_format":"1","workbook":"xlsx","n_sheets":9,"sheets":["RECONCILIATION","Main School","addl1","Community1","spare","CAPITAL","VAT & SUMMARY","Journal Template","Lists"],"not_rendered":{"charts":0,"images":1,"macros":1,"external_links":6,"defined_names":39,"comments":0,"pivot_tables":0},"unopened":[],"bounds":{"document_bytes":16777216,"sheet_cells":100000,"rows_first":2000,"rows_last":500,"rows_between":2000,"halvings":0,"cell_chars":16384,"cell_head_chars":4096},"cells_cut":0,"cells_raw":0,"read":"whole","date_system":"1900"}

{"sheet":"RECONCILIATION","index":0,"n_rows":92,"n_cols":16,"rows_kept":92,"cut":false,"hidden":false,"merged":[[89,2,89,4],[90,2,90,4],[91,2,91,4],[69,2,69,4],[85,2,85,4],[86,2,86,4],[87,2,87,4],[88,2,88,4],[79,2,79,4],[80,2,80,4],[81,2,81,4],[82,2,82,4],[83,2,83,4],[84,2,84,4],[76,2,76,4],[77,2,77,4],[78,2,78,4],[70,2,70,4],[71,2,71,4],[72,2,72,4],[73,2,73,4],[74,2,74,4],[75,2,75,4],[3,1,3,7],[12,1,12,9],[16,6,17,8],[16,9,17,9],[7,1,7,3],[10,1,10,3],[10,5,10,7],[10,9,10,11],[52,1,52,11],[26,6,32,9],[34,6,36,9],[41,1,43,12],[46,4,46,9],[48,4,48,9],[50,4,50,9],[19,11,21,12],[45,11,45,12],[7,5,7,11],[23,9,24,9],[10,15,10,16],[20,6,21,8],[20,9,21,9],[23,6,24,8]]}
[]
[]
[]
[null,"BWO  ELECTRONIC  IMPREST  CLAIM"]
[]
[]
[]
[null,"School Name:",null,null,null,"Click here to choose school name"]
[]
[]
[null,"Dates of Claim",null,null,null,null,null,null,"to ",null,null,null,null,null,null,"Please enter start and end dates"]
[]
[null,"Imprest Reconciliation"]
[]
[]
[null,"(1) Balance per current statement ",null,null,"Amount"]
[null,"Date of statement:",null,null,"£         P",null,"Total   (3+4+5) - This must equal your notional advance",null,null,{"$f":"SUM(E33+E35+E37)","v":0}]
[]
[]
[null,"Transactions since last statement"]
{"$rows_left_out":73}
{"sheet":"Main School","index":1,"n_rows":53,"n_cols":18,"rows_kept":53,"cut":false,"hidden":false,"merged":[[6,17,7,22],[8,17,17,22],[16,12,27,12],[41,12,43,12],[14,12,15,12],[40,13,40,14],[43,13,43,14],[5,12,5,15],[20,7,20,8],[8,2,8,3],[6,6,16,6],[16,7,16,8],[15,2,15,3],[13,13,13,14],[15,13,15,14],[6,12,13,12],[18,7,18,8],[47,6,52,6],[11,1,12,1],[9,1,10,1],[27,2,27,3],[39,6,46,6],[29,2,29,3],[32,2,32,3],[30,6,31,6],[24,2,24,3],[38,2,38,3],[25,1,27,1],[28,6,29,6],[28,1,29,1],[23,6,25,6],[17,6,18,6],[34,2,34,3],[1,1,1,3],[5,6,5,9],[10,2,10,3],[0,6,1,9],[29,7,29,8],[22,7,22,8],[5,1,5,4],[26,6,27,6],[13,1,15,1],[19,6,20,6],[6,1,8,1],[16,1,24,1],[35,1,36,1],[33,1,34,1],[30,1,32,1],[36,2,36,3],[21,6,22,6],[37,6,38,6],[28,12,29,12],[32,6,36,6],[45,13,45,14],[25,7,25,8],[27,13,27,14],[29,13,29,14],[31,7,31,8],[36,7,36,8],[47,13,47,14],[33,13,33,14],[35,13,35,14],[37,13,37,14],[52,7,52,8],[38,7,38,8],[46,7,46,8],[36,12,37,12],[34,12,35,12],[49,13,49,14],[46,12,47,12],[44,12,45,12],[38,12,40,12],[30,12,33,12]]}
[null,null,null,null,null,null,"Name will auto complete from Reconciliation Tab"]
[null,{"$f":"RECONCILIATION!F8","v":"Click here to choose school name"},null,null,{"$f":"IF(B2=\"Click here to choose school name\",\"\",VLOOKUP($B$2,Lists!$A$3:$B$25,2,FALSE))","v":""}]
[]
[]
[null,"CFR","Account","WiSER Description","£",null,"CFR","Account","WiSER Description","£",null,null,"CFR","Account","WiSER Description","£"]
[null,"INCOME (enter as -ve)",null,null,null,null,"EXPENDITURE",null,null,null,null,null,"EXPENDITURE"]
[null,"I03","R9101","Contributions - Other Local Authorities",null,null,"E08","R1600","Interview Expenses",null,null,null,"E20","R4534","Computing - Connectivity",null,null,{"$f":"IF(OR(E44>0,E45>0,E46>0),\"PLEASE PROVIDE AN EXPLANATION FOR ANY DEBITS IN INCOME OR CREDITS IN EXPENDITURE IN THE BOX BELOW\",\" \")","v":" "}]
[null,null,"R9004","Special Educational Needs Funding",null,null,null,"R1700","Employee Advertising Costs",null,null,null,null,"R4535","Computing -  \tOnsite servers"]
[null,null,"/////////////////////////////",null,{"$f":"SUM(E7:E8)","v":0},null,null,"R1061","Duty Meals Subsidy",null,null,null,null,"R4533","Computing - IT Learning Resources"]
[null,"I05","R9006","Pupil Premium",null,null,null,"R1400","Medical Fees",null,null,null,null,"R4531","Computing - Administration software and systems"]
[null,null,"/////////////////////////////",null,{"$f":"SUM(E10)","v":0},null,null,"R1802","Teachers Pension - School Funded",null,null,null,null,"R4530","Computing - Laptops, desktops and tablets"]
[null,"I06","R9000","Government Grants",null,null,null,"R3400","Mileage Expenses",null,null,null,null,"R4536","Computing - Other hardware"]
[null,null,""," /////////////////////////////",{"$f":"SUM(E12)","v":0},null,null,"R3300","Public Transport Expenses",null,null,null,null,"R4537","Computing - IT support"]
[null,"I07","R9106","Other Grants *",null,null,null,"R4200","Clothing",null,null,null,null,"/////////////////////////////",null,{"$f":"SUM(P7:P13)","v":0}]
[null,null,"R9102","Contributions - Developers",null,null,null,"R4100","Catering - Refreshments",null,null,null,"E21","R4602","Exam Expenses"]
[null,null,"/////////////////////////////",null,{"$f":"SUM(E14:E15)","v":0},null,null,"R1601","Employee - DBS Checks",null,null,null,null,"/////////////////////////////",null,{"$f":"SUM(P15:P15)","v":0}]
[null,"I08","R9200","Sales *",null,null,null,"/////////////////////////////",null,{"$f":"SUM(J7:J16)","v":0},null,null,"E22","R4000","Equipment Purchase"]
[null,null,"R9301","Charges *",null,null,"E09","R1650","Training Expenses",null,null,null,null,"R4300","Printing & Distribution"]
[null,null,"R9400","Rents",null,null,null,"/////////////////////////////",null,{"$f":"SUM(J18:J18)","v":0},null,null,null,"R4308","Stationery & Paper"]
[null,null,"R9401","Lettings *",null,null,"E10","R1411","Supply Cover Insurance - Teaching",null,null,null,null,"R4302","Publications"]
{"$rows_left_out":34}
{"sheet":"addl1","index":2,"n_rows":73,"n_cols":16,"rows_kept":73,"cut":false,"hidden":true,"merged":[[1,1,2,3],[1,4,2,4],[37,2,37,3],[52,13,52,14],[5,1,5,4],[5,6,5,9],[5,12,5,15],[17,6,18,6],[6,6,16,6],[24,1,26,1],[12,1,14,1],[10,1,11,1],[8,1,9,1],[6,1,7,1],[14,2,14,3],[11,2,11,3],[9,2,9,3],[7,2,7,3],[14,12,15,12],[12,12,13,12],[6,12,11,12],[39,6,46,6],[37,6,38,6],[32,6,36,6],[46,7,46,8],[38,7,38,8],[36,7,36,8],[30,6,31,6],[34,1,35,1],[32,1,33,1],[29,1,31,1],[35,2,35,3],[33,2,33,3],[31,2,31,3],[19,6,20,6],[26,2,26,3],[23,2,23,3],[15,1,23,1],[28,2,28,3],[27,1,28,1],[28,6,29,6],[26,6,27,6],[23,6,25,6],[21,6,22,6],[11,13,11,14],[13,13,13,14],[15,13,15,14],[31,13,31,14],[35,13,35,14],[29,13,29,14],[37,13,37,14],[36,12,37,12],[32,12,35,12],[49,12,50,12],[47,12,48,12],[43,12,46,12],[40,12,42,12],[38,12,39,12],[48,13,48,14],[50,13,50,14],[39,13,39,14],[42,13,42,14],[46,13,46,14],[22,7,22,8],[25,7,25,8],[30,12,31,12],[16,12,29,12],[18,7,18,8],[16,7,16,8],[20,7,20,8],[27,7,27,8],[29,7,29,8],[31,7,31,8]]}
[{"$f":"C25","v":"R9201"}]
[null,"Click here to choose additional name",null,null,{"$f":"VLOOKUP($B$2,addl1!$D$63:$E$73,2,FALSE)","v":"41XXX"}]
[]
[]
[null,"CFR","Account","WiSER Description","£",null,"CFR","Account","WiSER Description","£",null,null,"CFR","Account","WiSER Description","£"]
[null,"INCOME (enter as -ve)",null,null,null,null,"EXPENDITURE",null,null,null,null,null,"EXPENDITURE"]
[null,"I03","R9101","Contributions - Other Local Authorities",null,null,"E08","R1600","Interview Expenses",null,null,null,"E19","R3000","Petrol / Diesel"]
[null,null,"/////////////////////////////",null,{"$f":"SUM(E7)","v":0},null,null,"R1700","Employee Advertising Costs",null,null,null,null,"R3003","Vehicle Maintenance - Repairs"]
[null,"I05","R9006","Pupil Premium",null,null,null,"R1061","Duty Meals Subsidy",null,null,null,null,"R4005","Furniture Purchase"]
[null,null,"/////////////////////////////",null,{"$f":"SUM(E9)","v":0},null,null,"R1400","Medical Fees",null,null,null,null,"R4402","Services - Learning Resources (not ICT)"]
[null,"I06","R9000","Government Grants",null,null,null,"R1802","Teachers Pension - School Funded",null,null,null,null,"R4701","Subscriptions"]
[null,null,"/////////////////////////////",null,{"$f":"SUM(E11)","v":0},null,null,"R3400","Mileage Expenses",null,null,null,null,"/////////////////////////////",null,{"$f":"SUM(P7:P11)","v":0}]
[null,"I07","R9106","Other Grants *",null,null,null,"R3300","Public Transport Expenses",null,null,null,"E20","R4533","Computing - Learning Resources"]
[null,null,"R9102","Contributions - Developers",null,null,null,"R4200","Clothing",null,null,null,null,"/////////////////////////////",null,{"$f":"SUM(P13:P13)","v":0}]
[null,null,"/////////////////////////////",null,{"$f":"SUM(E13:E14)","v":0},null,null,"R4100","Catering - Refreshments",null,null,null,"E21","R4602","Exam Expenses"]
[null,"I08","R9200","Sales *",null,null,null,"R1601","Employee - DBS Checks",null,null,null,null,"/////////////////////////////",null,{"$f":"SUM(P15:P15)","v":0}]
[null,null,"R9301","Charges *",null,null,null,"/////////////////////////////",null,{"$f":"SUM(J7:J16)","v":0},null,null,"E22","R4000","Equipment Purchase"]
[null,null,"R9400","Rents",null,null,"E09","R1650","Training Expenses",null,null,null,null,"R4300","Printing & Distribution"]
[null,null,"R9401","Lettings *",null,null,null,"/////////////////////////////",null,{"$f":"SUM(J18:J18)","v":0},null,null,null,"R4308","Stationery & Paper"]
[null,null,"R9150","Staffing Reimbursements *",null,null,"E10","R1411","Supply Cover Insurance - Teaching",null,null,null,null,"R4302","Publications"]
{"$rows_left_out":54}
{"sheet":"Community1","index":3,"n_rows":49,"n_cols":10,"rows_kept":49,"cut":false,"hidden":true,"merged":[[1,1,1,3],[19,1,19,4],[5,1,5,3],[5,6,5,8],[6,6,39,6],[40,7,40,8],[6,1,8,1],[9,1,16,1],[8,2,8,3],[16,2,16,3]]}
[]
[null,"Click here for Community Focused Name",null,null,{"$f":"VLOOKUP($B$2,$D$48:$E$49,2,FALSE)","v":"415XX"}]
[]
[]
[null,"CFR","Account","WiSER Description","£",null,"CFR","Account","WiSER Description","£"]
[null,"INCOME (enter as -ve)",null,null,null,null,"EXPENDITURE"]
[null,"I16","R9000","Government Grants",null,null,"E32","R1600","Interview Expenses"]
[null,null,"R9106","Other Grants *",null,null,null,"R1700","Employee Advertising Costs"]
[null,null,"/////////////////////////////////////////////////////////",null,{"$f":"SUM(E7:E8)","v":0},null,null,"R1400","Medical Fees"]
[null,"I17","R9200","Sales *",null,null,null,"R1650","Training Expenses"]
[null,null,"R9400","Rents *",null,null,null,"R1101","Agency Supply Teaching Staff"]
[null,null,"R9401","Lettings *",null,null,null,"R2000","Reactive Maintenance"]
[null,null,"R9150","Staffing Reimbursements *",null,null,null,"R2001","Service Maintenance"]
[null,null,"R9151","Miscellaneous Income *",null,null,null,"R2750","Grounds Maintenance"]
[null,null,"R9140","Income Donations",null,null,null,"R2100","Electricity"]
[null,null,"R9500","Interest Received",null,null,null,"R2101","Gas"]
[null,null,"/////////////////////////////////////////////////////////",null,{"$f":"SUM(E10:E16)","v":0},null,null,"R4451","Services - Internally Provided Room Hire"]
[null,null,null,null,null,null,null,"R2400","Water Charges"]
[null,null,"Total Income",null,{"$f":"SUM(E9,E17)","v":0},null,null,"R2700","Cleaning"]
[null,"* these items may be Subject to VAT, please see the VAT Manual",null,null,null,null,null,"R2705","Hygiene Services"]
{"$rows_left_out":30}
{"sheet":"spare","index":4,"n_rows":55,"n_cols":21,"rows_kept":55,"cut":false,"hidden":true,"merged":[[5,17,5,20],[25,18,25,19],[27,18,27,19],[1,1,2,3],[1,4,2,4],[1,6,1,9],[5,12,5,15],[5,6,5,9],[5,1,5,4],[6,6,16,6],[27,1,28,1],[24,1,26,1],[15,1,23,1],[12,1,14,1],[10,1,11,1],[8,1,9,1],[52,13,52,14],[14,12,15,12],[12,12,13,12],[6,12,11,12],[26,6,27,6],[23,6,25,6],[21,6,22,6],[19,6,20,6],[17,6,18,6],[37,13,37,14],[39,13,39,14],[49,12,50,12],[47,12,48,12],[43,12,46,12],[40,12,42,12],[31,7,31,8],[6,1,7,1],[23,2,23,3],[36,12,37,12],[34,1,35,1],[32,1,33,1],[29,1,31,1],[37,6,38,6],[32,6,36,6],[30,6,31,6],[28,6,29,6],[32,12,35,12],[30,12,31,12],[16,12,29,12],[38,12,39,12],[9,2,9,3],[11,2,11,3],[50,13,50,14],[27,7,27,8],[35,2,35,3],[31,2,31,3],[28,2,28,3],[33,2,33,3],[39,6,46,6],[29,7,29,8],[46,7,46,8],[38,7,38,8],[37,2,37,3],[42,13,42,14],[46,13,46,14],[48,13,48,14],[29,13,29,14],[31,13,31,14],[35,13,35,14],[7,2,7,3],[11,13,11,14],[13,13,13,14],[15,13,15,14],[22,7,22,8],[20,7,20,8],[18,7,18,8],[16,7,16,8],[14,2,14,3],[26,2,26,3],[25,7,25,8]]}
[]
[null,"Enter Name",null,null,"41XXX",null,"Please enter name of facility / extended service"]
[]
[]
[null,"CFR","Account","WiSER Description","£",null,"CFR","Account","WiSER Description","£",null,null,"CFR","Account","WiSER Description","£",null,"CFR","Account","WiSER Description","£"]
[null,"INCOME (enter as -ve)",null,null,null,null,"EXPENDITURE",null,null,null,null,null,"EXPENDITURE",null,null,null,null,"EXPENDITURE"]
[null,"I03","R9101","Contributions - Other Local Authorities",null,null,"E08","R1600","Interview Expenses",null,null,null,"E19","R3000","Petrol / Diesel",null,null,"E32","R1600","Interview Expenses"]
[null,null,"/////////////////////////////",null,{"$f":"SUM(E7)","v":0},null,null,"R1700","Employee Advertising Costs",null,null,null,null,"R3003","Vehicle Maintenance - Repairs",null,null,null,"R1700","Employee Advertising Costs"]
[null,"I05","R9006","Pupil Premium",null,null,null,"R1061","Duty Meals Subsidy",null,null,null,null,"R4005","Furniture Purchase",null,null,null,"R1400","Medical Fees"]
[null,null,"/////////////////////////////",null,{"$f":"SUM(E9)","v":0},null,null,"R1400","Medical Fees",null,null,null,null,"R4402","Services - Learning Resources (not ICT)",null,null,null,"R1650","Training Expenses"]
[null,"I06","R9000","Government Grants",null,null,null,"R1802","Teachers Pension - School Funded",null,null,null,null,"R4701","Subscriptions",null,null,null,"R1101","Agency Supply Teaching Staff"]
[null,null,"/////////////////////////////",null,{"$f":"SUM(E11)","v":0},null,null,"R3400","Mileage Expenses",null,null,null,null,"/////////////////////////////",null,{"$f":"SUM(P7:P11)","v":0},null,null,"R4451","Services - Internally Provided Room Hire"]
[null,"I07","R9106","Other Grants *",null,null,null,"R3300","Public Transport Expenses",null,null,null,"E20","R4533","Computing - Learning Resources",null,null,null,"R3400","Mileage Expenses"]
[null,null,"R9102","Contributions - Developers",null,null,null,"R4200","Clothing",null,null,null,null,"/////////////////////////////",null,{"$f":"SUM(P13:P13)","v":0},null,null,"R3300","Public Transport Expenses"]
[null,null,"/////////////////////////////",null,{"$f":"SUM(E13:E14)","v":0},null,null,"R4100","Catering - Refreshments",null,null,null,"E21","R4602","Exam Expenses",null,null,null,"R4000","Equipment Purchase"]
[null,"I08","R9200","Sales *",null,null,null,"R1601","Employee - DBS Checks",null,null,null,null,"/////////////////////////////",null,{"$f":"SUM(P15:P15)","v":0},null,null,"R4101","Catering - Provisions"]
[null,null,"R9301","Charges *",null,null,null,"/////////////////////////////",null,{"$f":"SUM(J7:J16)","v":0},null,null,"E22","R4000","Equipment Purchase",null,null,null,"R4308","Stationery & Paper"]
[null,null,"R9400","Rents",null,null,"E09","R1650","Training Expenses",null,null,null,null,"R4300","Printing & Distribution",null,null,null,"R4302","Publications"]
[null,null,"R9401","Lettings *",null,null,null,"/////////////////////////////",null,{"$f":"SUM(J18:J18)","v":0},null,null,null,"R4308","Stationery & Paper",null,null,null,"R4305","Photocopying"]
[null,null,"R9150","Staffing Reimbursements *",null,null,"E10","R1411","Supply Cover Insurance - Teaching",null,null,null,null,"R4302","Publications",null,null,null,"R4312","Postage"]
{"$rows_left_out":36}
{"sheet":"CAPITAL","index":5,"n_rows":75,"n_cols":17,"rows_kept":75,"cut":false,"hidden":false,"merged":[[1,4,2,8],[1,9,2,10],[42,2,42,3],[56,2,56,4],[1,2,2,3],[12,8,12,9],[56,9,56,10],[6,2,6,4],[6,9,6,10],[26,9,26,10],[36,2,36,4],[62,2,62,3],[62,8,62,9],[12,2,12,3],[56,5,56,7],[22,2,22,3],[26,5,26,7],[46,9,46,10],[16,2,16,4],[16,9,16,10],[26,2,26,4],[6,18,12,21],[32,8,32,9],[52,2,52,3],[52,8,52,9],[36,5,36,7],[32,2,32,3],[42,8,42,9],[46,5,46,7],[36,9,36,10],[46,2,46,4],[6,5,6,7],[16,5,16,7],[31,14,31,16],[21,14,21,16],[4,14,4,16],[6,14,9,16],[18,14,19,16],[11,14,16,16],[22,8,22,9]]}
[]
[null,null,"Capital",null,{"$f":"'Main School'!B2","v":"Click here to choose school name"},null,null,null,null,{"$f":"'Main School'!E2","v":""}]
[]
[]
[null,null,null,null,null,null,null,null,null,null,null,null,null,null,"Please enter the Project Description"]
[]
[null,null,"Description of Project",null,null,null,null,null,null,"Project Code",null,null,null,null,"The Project code MUST be used. They will be in the format \"C####\".\n\nNote: Any amounts without a project code may be put to revenue."]
[null,null,"cfr","Account","Work Order","Expenditure £",null,null,"cfr","Account","Work Order","Income £"]
[null,null,"CE01","C1100",null,null,null,null,"Ci01","C7000"]
[null,null,"CE02","C1100",null,null,null,null,"Ci01","C7001"]
[null,null,"CE03","C1100",null,null,null,null,"Ci03","C7006"]
[null,null,"CE04","C1100",null,null,null,null,"Ci04","C7005",null,null,null,null,"We have put in Account (ledger) code of C1100 because most of your projects will be construction.\n\nIf you are spending money on another code, please overwrite the code with the relevant code as below"]
[null,null,"Total",null,null,{"$f":"SUM(F9:F12)","v":0},null,null,"Total",null,null,{"$f":"SUM(L9:L12)","v":0}]
[]
[]
[]
[null,null,"Description of Project",null,null,null,null,null,null,"Project Code"]
[null,null,"cfr","Account","Work Order","Expenditure £",null,null,"cfr","Account","Work Order","Income £"]
[null,null,"CE01","C1100",null,null,null,null,"Ci01","C7000",null,null,null,null,"Please enter the last 3 digits of the Work Order (the hyphen \"-\" is NOT required)"]
[null,null,"CE02","C1100",null,null,null,null,"Ci01","C7001"]
{"$rows_left_out":56}
{"sheet":"VAT & SUMMARY","index":6,"n_rows":41,"n_cols":10,"rows_kept":41,"cut":false,"hidden":false,"merged":[[21,1,21,2],[23,3,24,6],[25,3,25,6],[26,3,26,5],[27,3,27,6],[1,9,16,9],[33,3,33,6],[30,3,30,5],[34,3,35,5],[31,3,31,6],[32,3,32,5],[28,3,28,5],[29,3,29,6]]}
[]
[null,"Total vat for all cost centres taken from your bank claim report",null,null,null,null,null,null,null,"\nTo calculate VAT amount for each code:\n= expenditure figure from ledger code breakdown\nless receipts figure from ledger code breakdown\nplus petty cash VAT (15% exp only)\nplus any reimbursements showing on cheque listing pages (will be -ve for income vat)\n\nNB enter reimbursement separately on fms6 for each (credit 9000/2/4 for exp vat and debit 9006/8 for inc vat)"]
[]
[]
[null,"Net Expenditure for Main School",null,null,{"$f":"'Main School'!E2","v":""},null,{"$f":"'Main School'!P52","v":0}]
[]
[null,"Net Expenditure for Community 1",null,null,{"$f":"Community1!$E$2","v":"415XX"},null,{"$f":"Community1!$J$45","v":0}]
[]
[null,"Net Expenditure for Additional 1",null,null,{"$f":"addl1!$E$2","v":"41XXX"},null,{"$f":"addl1!P55","v":0}]
[]
[null,"Net Expenditure for \"spare\"",null,null,{"$f":"spare!E2","v":"41XXX"},null,{"$f":"spare!U30","v":0}]
[]
[null,"Net Expenditure for Capital",null,null,null,null,{"$f":"CAPITAL!F13+CAPITAL!L13+CAPITAL!F23+CAPITAL!L23+CAPITAL!F33+CAPITAL!L33+CAPITAL!F43+CAPITAL!L43+CAPITAL!F53+CAPITAL!L53+CAPITAL!F63+CAPITAL!L63","v":0}]
[]
[null,"VAT Expenditure 20%"]
[]
[null,"VAT Expenditure 5%"]
[]
[null,"VAT Income 20% (Input as negative)",null,null,null,null,null,null,null,{"$f":"IF(G40>(G39*20%),\"PLEASE PROVIDE VAT EXPLANATION IN THE BOX BELOW\",\" \")","v":" "}]
[]
{"$rows_left_out":22}
{"sheet":"Journal Template","index":7,"n_rows":412,"n_cols":21,"rows_kept":412,"cut":false,"hidden":false,"merged":[[409,3,409,10]]}
["setdefault account="]
["setdefault amount="]
["setdefault client=WBC"]
["setdefault cur_amount="]
["setdefault currency=GBP"]
["setdefault description="]
["setdefault variant_number=99"]
["setdefault dim_1=C1"]
["setdefault dim_2=B0"]
["setdefault dim_3=C0"]
["setdefault dim_4=BF"]
["setdefault dim_5=CG"]
["setdefault dim_6=62"]
["setdefault dim_7=70"]
[{"$f":"\"setdefault apar_name=IMPREST \"&RECONCILIATION!$F$8","v":"setdefault apar_name=IMPREST Click here to choose school name"}]
["setdefault interface=GL"]
["setdefault number_1=0"]
[{"$f":"\"setdefault period=\"&$N$31","v":"setdefault period="}]
["setdefault sequence_no="]
["setdefault status=N"]
{"$rows_left_out":393}
{"sheet":"Lists","index":8,"n_rows":25,"n_cols":7,"rows_kept":25,"cut":false,"hidden":true,"merged":[]}
[null,"Cost Centre","Notional Adv"]
["Click here to choose school name"]
["Aldryngton Primary","41101",24500,{"$f":"A3&\" Imprest\"","v":"Aldryngton Primary Imprest"},"P0501",82050,"91101"]
["Bearwood Primary","41103",19320,"Bearwood Primary Imprest","P0504",82054,91103]
["CAMHS Phoenix School",41399,400,"CAMHS Phoenix School Imprest","P0003"]
["Colleton Primary School","41105",26670,"Colleton Primary School Imprest","P0507",82058,91105]
["Farley Hill Primary","41111",14280,"Farley Hill Primary Imprest","P0514",82070,91111]
["Finchampstead CE (Aided) Primary School","41112",7980,"Finchampstead CE (Aided) Primary School Imprest","P0515",82072,91112]
["Gorse Ride Infant","41113",18090,"Gorse Ride Infant Imprest","P0517",82074,91113]
["Gorse Ride Junior","41114",20500,"Gorse Ride Junior Imprest","P0518",82076,91114]
["Grazeley Parochial C of E (Aided)","41115",14000,"Grazeley Parochial C of E (Aided) Imprest","P0519",82078,91115]
["Lambs Lane",41122,15330,"Lambs Lane Imprest","P0527"]
["Loddon Primary",41153,41500,"Loddon Primary Imprest","P0528",82098,91124]
["Radstock Primary","41131",31990,"Radstock Primary Imprest","P0536",82112,91131]
["Robert Piggott C of E Infant School","41133",13540,"Robert Piggott C of E Infant School Imprest","P0538",82116,91133]
["Robert Piggott C of E Junior School","41134",12180,"Robert Piggott C of E Junior School Imprest","P0539",82118,91134]
["Shinfield St Mary's C of E Junior","41136",22400,"Shinfield St Mary's C of E Junior Imprest","P0542",82120,91136]
["St Dominic Savio Catholic Primary","41139",29120,"St Dominic Savio Catholic Primary Imprest","P0547",82128,91139]
["St Paul's C of E Junior School","41141",26740,"St Paul's C of E Junior School Imprest","P0549",82132,91141]
["Walter Infant School & Nursery","41144",26210,"Walter Infant School & Nursery Imprest","P0553",82138,91144]
{"$rows_left_out":5}