{"text_format":"1","workbook":"xlsx","n_sheets":13,"sheets":["Calculator","Final Allocations 2024-25","SC","Config","SC Control Sheet","SC Accrual Detail","Tables","SD","Config (2)","SD Control Sheet","SD Accrual Detail","Tables (2)","Dates_Pmts_Info"],"not_rendered":{"charts":0,"images":3,"macros":1,"external_links":7,"defined_names":42,"comments":2,"pivot_tables":0},"unopened":[],"bounds":{"document_bytes":16777216,"sheet_cells":100000,"rows_first":2000,"rows_last":500,"rows_between":2000,"halvings":0,"cell_chars":16384,"cell_head_chars":4096},"cells_cut":0,"cells_raw":0,"read":"whole","date_system":"1900"}

{"sheet":"Calculator","index":0,"n_rows":31,"n_cols":10,"rows_kept":31,"cut":false,"hidden":false,"merged":[[0,1,0,8],[29,2,29,10],[18,2,18,9],[17,2,17,9],[19,2,19,9],[2,0,2,9],[3,0,3,9],[10,2,10,9],[16,2,16,9],[11,2,11,9],[12,2,12,9],[13,2,13,9]]}
["Select your school from the drop down list:","Please select from the list",null,null,null,null,null,null,null,{"$f":"IF(B1=\"Please select from the list\",\"\",VLOOKUP(B1,Dates_Pmts_Info!$P$4:$Q$17,2,FALSE))","v":""}]
[null,null," "]
[{"$f":"CONCATENATE(\"Universal Infant Free School Meals (UIFSM) - estimate calculator for academic year \",Dates_Pmts_Info!A2,\" to \",Dates_Pmts_Info!B2)","v":"Universal Infant Free School Meals (UIFSM) - estimate calculator for academic year 2025 to 2026"}]
[" This table shows how the UIFSM grant will be calculated and paid.  LAs and schools can use this to estimate their allocation.  \nThe relevant pupil data can be entered in cells bordered in red.  Any figure estimated should not be taken as confirmation of the final allocation. \nPlease read the UIFSM Conditions of Grant when using this calculator."]
["Pupil data","(a)","(b)","(c)","(d)","(e)","(f)","(g)"]
["School Census ","Meals taken by ALL pupils in Year Groups 1 and 2","Meals taken by FSM pupils in Year Groups 1 and 2","Meals taken by grant eligible pupils in Year Groups1 and 2 (a) - (b)","Meals taken by ALL pupils in Year Group R","Meals taken by FSM pupils in Year Group R","Meals taken by grant eligible pupils in Year Group R (d) - (e)","Total pupils on roll (all pupils, including nursery)"]
[{"$f":"CONCATENATE(\"October \",Dates_Pmts_Info!A2)","v":"October 2025"},null,null,{"$f":"B7-C7","v":0},null,null,{"$f":"E7-F7","v":0},"n/a"]
[{"$f":"CONCATENATE(\"January \",Dates_Pmts_Info!B2)","v":"January 2026"},null,null,{"$f":"B8-C8","v":0},null,null,{"$f":"E8-F8","v":0},"n/a"]
[]
[{"$f":"CONCATENATE(\"Provisional Allocation (the same as the final allocation for \",Dates_Pmts_Info!D2,\" to \",Dates_Pmts_Info!E2,\" academic year).\")","v":"Provisional Allocation (the same as the final allocation for 2024 to 2025 academic year)."}]
{"$rows_left_out":22}
{"sheet":"Final Allocations 2024-25","index":1,"n_rows":17,"n_cols":26,"rows_kept":17,"cut":false,"hidden":false,"merged":[[0,0,1,10]]}
["School Details"]
[]
["Unique Reference Number (URN)","UK Provider Reference Number (UKPRN)","Local Authority Establishment Number (LAEstab)","Local Authority Code","Local Authority Name","Establishment Number","School Name","Cost Centre","Provisional payment made in June / July 2024 (£)","Final allocation for 2024/25 (£)","Final payment for 2024/25 (Col J - Col K) (£)","Meals taken by Reception pupils from October 2024 census","Meals taken by Reception FSM pupils from October 2024 census","Total Eligible Meals taken by Reception pupils from October 2024 census (Col M - Col N)","Meals taken by Year 1 and Year 2 pupils from October 2024 census","Meals taken by Year 1 and Year 2 FSM pupils from October 2024 census","Total Eligible Meals taken by Year 1 and Year 2 pupils from October 2024 census (Col P - Col Q)","Meals taken by Reception pupils from January 2025 census","Meals taken by Reception FSM pupils from January 2025 census","Total Eligible Meals taken by Reception pupils from January 2025 census (Col S - Col T)","Meals taken by Year 1 and Year 2 pupils from January 2025 census","Meals taken by Year 1 and Year 2 FSM pupils from January 2025 census","Total Eligible Meals taken by Year 1 and Year 2 pupils from January 2025 census (Col V - Col W)","Total Eligible Meals taken by Reception pupils used in 2023-24 final allocation calculation","Total Eligible Meals taken by Year 1 and Year 2 pupils used in 2023-24 final allocation calculation","Total Eligible Meals taken by Infant pupils used in 2023-24 final allocation calculation (Col Y + Col Z)"]
[109829,10077315,8722088,872,"Wokingham",2088,"Farley Hill Primary School",{"$f":"VLOOKUP(G4,Dates_Pmts_Info!$P$4:$Q$17,2,FALSE)","v":41111},38697,75246,36549,60,4,56,112,11,101,52,5,47,113,10,103,51.5,102,153.5]
[109830,10042648,8722089,872,"Wokingham",2089,"Lambs Lane Primary School",{"$f":"VLOOKUP(G5,Dates_Pmts_Info!$P$4:$Q$17,2,FALSE)","v":41122},15984,34314,18330,27,1,26,55,10,45,26,1,25,53,9,44,25.5,44.5,70]
[109836,10068906,8722100,872,"Wokingham",2100,"Bearwood Primary School",{"$f":"VLOOKUP(G6,Dates_Pmts_Info!$P$4:$Q$17,2,FALSE)","v":41103},19489,27452,7963,17,2,15,48,7,41,14,1,13,49,6,43,14,42,56]
[109850,10074557,8722116,872,"Wokingham",2116,"Aldryngton Primary School",{"$f":"VLOOKUP(G7,Dates_Pmts_Info!$P$4:$Q$17,2,FALSE)","v":41101},32528,52697,20169,40,0,40,70,3,67,40,0,40,71,3,68,40,67.5,107.5]
[109869,10069743,8722137,872,"Wokingham",2137,"Walter Infant School",{"$f":"VLOOKUP(G8,Dates_Pmts_Info!$P$4:$Q$17,2,FALSE)","v":41144},65196,99511,34315,58,5,53,164,15,149,59,5,54,167,18,149,54,149,203]
[109876,10068958,8722146,872,"Wokingham",2146,"Winnersh Primary School",{"$f":"VLOOKUP(G9,Dates_Pmts_Info!$P$4:$Q$17,2,FALSE)","v":41151},40099,56128,16029,32,3,29,91,6,85,33,2,31,89,7,82,31,83.5,114.5]
[109878,10068957,8722149,872,"Wokingham",2149,"The Colleton Primary School",{"$f":"VLOOKUP(G10,Dates_Pmts_Info!$P$4:$Q$17,2,FALSE)","v":41105},19770,37501,17731,22,0,22,54,3,51,24,0,24,57,3,54,24,52.5,76.5]
{"$rows_left_out":8}
{"sheet":"SC","index":2,"n_rows":32,"n_cols":12,"rows_kept":32,"cut":false,"hidden":true,"merged":[[28,0,29,11],[3,11,5,11],[5,3,5,8],[7,0,8,6],[7,9,7,11],[8,9,8,11],[26,0,26,11]]}
["Sundry CREDITOR Accounts Payable - Schools Only"]
[]
[]
["Schools",null,null,null,null,null,null,null,null,null,null,{"$f":"CONCATENATE(\"Closedown \",Dates_Pmts_Info!C2)","v":"Closedown 2025-26"}]
[]
["School Name: ",null,null,{"$f":"Calculator!B1","v":"Please select from the list"}]
[]
["NB Grey cells will automatically complete",null,null,null,null,null,null,"Amount",null,"Required for Audit purposes only."]
[null,null,null,null,null,null,null,"Excluding VAT","This data will appear on BWO.","(this data will not appear on BWO)"]
["Account Code","Cost Centre","Project code","Category 4","Category 5","Analysis","+/-","£","Name of Supplier and Invoice Number","Date Goods /Services Received",null,"Description"]
{"$rows_left_out":23}
{"sheet":"Config","index":3,"n_rows":13,"n_cols":2,"rows_kept":13,"cut":false,"hidden":true,"merged":[]}
["Settings","Value"]
["Provider","SQLOLEDB"]
["Data Source","WDC-SQLTEST01\\AGRESSOTEST"]
["Database","Agresso"]
["User Id","wbcfin"]
["Password","!0553rgA"]
["Show Errors and Warnings","N"]
["Show Connection String Only","N"]
["Show Errors and Account Warnings Start Column",27]
["Start Row of Journal",47]
{"$rows_left_out":4}
{"sheet":"SC Control Sheet","index":4,"n_rows":26,"n_cols":5,"rows_kept":26,"cut":false,"hidden":true,"merged":[]}
[]
[null,null,null,"BWO - Accrual Control Sheet"]
[]
[]
[null,null,null,"Accrual Details"]
[null,null,null,"Description",{"$f":"SC!I12","v":"UIFSM Grant Accrual 2025-26"}]
[null,null,null,"Accrual Period",{"$f":"Dates_Pmts_Info!L2","v":202512}]
[null,null,null,"Reversing Period",{"$f":"Dates_Pmts_Info!M2","v":202601}]
[null,null,null,"Accrual Type","Sundry Creditors (BZ549)"]
[null,null,null,"Balance Sheet Cost Centre","Corporate Balance Sheet (90000)"]
{"$rows_left_out":17}
{"sheet":"SC Accrual Detail","index":5,"n_rows":1054,"n_cols":73,"rows_kept":1054,"cut":false,"hidden":true,"merged":[]}
[{"$f":"D1&E1","v":"setdefault account="},null,null,"setdefault account=",null,null,{"$f":"'SC Control Sheet'!E9","v":"Sundry Creditors (BZ549)"},{"$f":"IF(G1=0,\"\",VLOOKUP(G1,Tables!E:F,2,FALSE))","v":"BZ549"}]
["setdefault amount=",null,null,"setdefault amount=",null,null,{"$f":"'SC Control Sheet'!E10","v":"Corporate Balance Sheet (90000)"},{"$f":"IF(G2=0,\"\",VLOOKUP(G2,Tables!G:H,2,FALSE))","v":90000}]
["setdefault client=WBC",null,null,"setdefault client=","WBC",null,{"$f":"'SC Control Sheet'!E11","v":"Children's Services - Schools Block (99999-112)"},{"$f":"IF(G3=0,\"\",VLOOKUP(G3,Tables!I:J,2,FALSE))","v":"99999-112"}]
["setdefault cur_amount=",null,null,"setdefault cur_amount=",null,null,{"$f":"'SC Control Sheet'!E12","v":"Revenue (REV01)"},{"$f":"IF(G4=0,\"\",VLOOKUP(G4,Tables!K:L,2,FALSE))","v":"REV01"}]
["setdefault currency=GBP",null,null,"setdefault currency=","GBP",null,{"$f":"'SC Control Sheet'!E13","v":0},{"$f":"IF(G5=0,\"\",VLOOKUP(G5,Tables!M:N,2,FALSE))","v":""}]
["setdefault description=",null,null,"setdefault description=",null,null,{"$f":"'SC Control Sheet'!E14","v":0},{"$f":"IF(G6=0,\"\",VLOOKUP(G6,Tables!O:P,2,FALSE))","v":""}]
["setdefault variant_number=99",null,null,"setdefault variant_number=",99,null,{"$f":"'SC Control Sheet'!E7","v":"2454-06-15"},{"$f":"'SC Control Sheet'!$E$7","v":202512}]
["setdefault dim_1=C1",null,null,"setdefault dim_1=",{"$f":"VLOOKUP('SC Control Sheet'!E20,Tables!S:T,2,FALSE)","v":"C1"},null,{"$f":"'SC Control Sheet'!E8","v":"2454-09-12"},{"$f":"'SC Control Sheet'!$E$8","v":202601}]
["setdefault dim_2=B0",null,null,"setdefault dim_2=",{"$f":"VLOOKUP('SC Control Sheet'!E21,Tables!S:T,2,FALSE)","v":"B0"}]
["setdefault dim_3=C0",null,null,"setdefault dim_3=",{"$f":"VLOOKUP('SC Control Sheet'!E22,Tables!S:T,2,FALSE)","v":"C0"}]
{"$rows_left_out":1045}
{"sheet":"Tables","index":6,"n_rows":123,"n_cols":32,"rows_kept":123,"cut":false,"hidden":true,"merged":[]}
[]
[null,"Month","Period",null,"Description","Account","Description","CostC","Description","Analysis4","Description","Analysis3","Description","Analysis2","Description","Analysis",null,null,"Name","ID",null,null,"Description","Analysis3","Description","Analysis3","Len","Type","Description","Cat","Mnt","S"]
[null,"Please select","Please select",null,"Sundry Creditors (BZ549)","BZ549","Corporate Balance Sheet (90000)",90000,"Please select",null,{"$f":"IF(IF('SC Control Sheet'!$E$9=\"Receipts in Advance (BZ547)\",Tables!Y3,Tables!W3)=0,\"\",IF('SC Control Sheet'!$E$9=\"Receipts in Advance (BZ547)\",Tables!Y3,Tables!W3))","v":"Capital (CAP01)"},"CAP01","NNDR (Z7001)","Z7001","Prior Year Adjustments (Z9001)","Z9001",null,null,"text att_name","text attribute_id",null,null,"Capital (CAP01)","CAP01","Capital (CAP01)","CAP01","text data_length","text data_type","text description","text dim_position","text maintenance","text status"]
[null,"2015-03-01",201412,null,null,null,"Farley Hill Balance Sheet (91111)",91111,"Chief Executives Office (99999-101)","99999-101",{"$f":"IF(IF('SC Control Sheet'!$E$9=\"Receipts in Advance (BZ547)\",Tables!Y4,Tables!W4)=0,\"\",IF('SC Control Sheet'!$E$9=\"Receipts in Advance (BZ547)\",Tables!Y4,Tables!W4))","v":"Revenue (REV01)"},"REV01","Summons Costs (Z7002)","Z7002","PFI Finance Lease Payment (Z9002)","Z9002",null,null,null,"Position 0",null,null,"Revenue (REV01)","REV01","Revenue (REV01)","REV01"]
[null,"Adj-15",201413,null,null,null,"The Holt Balance Sheet (91204)",91204,"Adult Services (99999-103)","99999-103",{"$f":"IF(IF('SC Control Sheet'!$E$9=\"Receipts in Advance (BZ547)\",Tables!Y5,Tables!W5)=0,\"\",IF('SC Control Sheet'!$E$9=\"Receipts in Advance (BZ547)\",Tables!Y5,Tables!W5))","v":""},null,"Carters Hill Park (Z7101)","Z7101","Payments in Year (Z9003)","Z9003",null,"ACCOUNT","ACCOUNT","A0",null,null,null,null,"Housing GF Accounts 2003/04 (Y9001)","Y9001",8,"A","Account",0,"A","N"]
[null,"2015-04-01",201501,null,null,null,"Waingels Copse Balance Sheet (91209)",91209,"Children's Services (99999-104)","99999-104",{"$f":"IF(IF('SC Control Sheet'!$E$9=\"Receipts in Advance (BZ547)\",Tables!Y6,Tables!W6)=0,\"\",IF('SC Control Sheet'!$E$9=\"Receipts in Advance (BZ547)\",Tables!Y6,Tables!W6))","v":""},null,"Twyford Orchards (Z7102)","Z7102","Interest Paid on Balances (Z9004)","Z9004",null,null,null,"Category 1",null,null,null,null,"Housing GF Accounts 2008/09 (Y9002)","Y9002"]
[null,"2015-05-01",201502,null,null,null,"HRA Balance Sheet (93500)",93500,"Place & Growth (99999-105)","99999-105",{"$f":"IF(IF('SC Control Sheet'!$E$9=\"Receipts in Advance (BZ547)\",Tables!Y7,Tables!W7)=0,\"\",IF('SC Control Sheet'!$E$9=\"Receipts in Advance (BZ547)\",Tables!Y7,Tables!W7))","v":""},null,"Grovelands (Z7201)","Z7201","Precepts Paid (Z9005)","Z9005",null,"CAT1","COSTC","C1",null,null,null,null,"Housing GF Accounts 2009/10 (Y9003)","Y9003",8,"A","Cost centre (CC)",1,"M","N"]
[null,"2015-06-01",201503,null,null,null,null,null,"Resources & Assets (99999-106)","99999-106",{"$f":"IF(IF('SC Control Sheet'!$E$9=\"Receipts in Advance (BZ547)\",Tables!Y8,Tables!W8)=0,\"\",IF('SC Control Sheet'!$E$9=\"Receipts in Advance (BZ547)\",Tables!Y8,Tables!W8))","v":""},null,"California Homeless (Z7202)","Z7202","DR Transfer to Services (Z9006)","Z9006",null,null,null,"Category 2",null,null,null,null,"Housing GF Accounts 2010/11 (Y9004)","Y9004"]
[null,"2015-07-01",201504,null,null,null,null,null,"Housing General Fund (99999-110)","99999-110",{"$f":"IF(IF('SC Control Sheet'!$E$9=\"Receipts in Advance (BZ547)\",Tables!Y9,Tables!W9)=0,\"\",IF('SC Control Sheet'!$E$9=\"Receipts in Advance (BZ547)\",Tables!Y9,Tables!W9))","v":""},null,"Oxford Road (Z7203)","Z7203","Service Charge (Z9007)","Z9007",null,"CAT2","PROJECT","B0",null,null,null,null,"Housing GF Accounts 2011/12 (Y9005)","Y9005",8,"A","Project code",2,"M","N"]
[null,"2015-08-01",201505,null,null,null,null,null,"Housing Revenue Account (99999-111)","99999-111",{"$f":"IF(IF('SC Control Sheet'!$E$9=\"Receipts in Advance (BZ547)\",Tables!Y10,Tables!W10)=0,\"\",IF('SC Control Sheet'!$E$9=\"Receipts in Advance (BZ547)\",Tables!Y10,Tables!W10))","v":""},null,"Shared Owernership (Z7204)","Z7204","IAS 19 - Pension Costs (Z9008)","Z9008",null,null,null,"Category 3",null,null,null,null,"Housing GF Accounts 2012/13 (Y9006)","Y9006"]
{"$rows_left_out":114}
{"sheet":"SD","index":7,"n_rows":32,"n_cols":12,"rows_kept":32,"cut":false,"hidden":true,"merged":[[28,0,29,11],[26,0,26,11],[3,11,5,11],[5,3,5,8],[7,0,8,6],[7,9,7,11],[8,9,8,11]]}
["Sundry DEBTOR Accounts Receivable - Schools Only"]
["To be used for any invoices/charges relating to goods/services that arrived before or on 31st March 2023 and which have not been charged to BWO"]
[]
["Schools",null,null,null,null,null,null,null,null,null,null,{"$f":"CONCATENATE(\"Closedown \",Dates_Pmts_Info!C2)","v":"Closedown 2025-26"}]
[]
["School Name: ",null,null,{"$f":"Calculator!B1","v":"Please select from the list"}]
[]
["NB Grey cells will automatically complete",null,null,null,null,null,null,"Amount",null,"Required for Audit purposes only."]
[null,null,null,null,null,null,null,"Excluding VAT","This data will appear on BWO.","(this data will not appear on BWO)"]
["Account Code","Cost Centre","Project","Category 4","Category 5","Analysis","+/-","£","Name of Debtor and Invoice Number","Date Goods /Services Received",null,"Description"]
{"$rows_left_out":23}
{"sheet":"Config (2)","index":8,"n_rows":13,"n_cols":2,"rows_kept":13,"cut":false,"hidden":true,"merged":[]}
["Settings","Value"]
["Provider","SQLOLEDB"]
["Data Source","WDC-SQLTEST01\\AGRESSOTEST"]
["Database","Agresso"]
["User Id","wbcfin"]
["Password","!0553rgA"]
["Show Errors and Warnings","N"]
["Show Connection String Only","N"]
["Show Errors and Account Warnings Start Column",27]
["Start Row of Journal",47]
{"$rows_left_out":4}
{"sheet":"SD Control Sheet","index":9,"n_rows":26,"n_cols":5,"rows_kept":26,"cut":false,"hidden":true,"merged":[]}
[]
[null,null,null,"BWO - Accrual Control Sheet"]
[]
[]
[null,null,null,"Accrual Details"]
[null,null,null,"Description",{"$f":"SD!I11","v":"Sundry Debtor for Please select from the list"}]
[null,null,null,"Accrual Period",{"$f":"Dates_Pmts_Info!L2","v":202512}]
[null,null,null,"Reversing Period",{"$f":"Dates_Pmts_Info!M2","v":202601}]
[null,null,null,"Accrual Type","Sundry Debtors (BZ345)"]
[null,null,null,"Balance Sheet Cost Centre","Corporate Balance Sheet (90000)"]
{"$rows_left_out":17}
{"sheet":"SD Accrual Detail","index":10,"n_rows":1054,"n_cols":73,"rows_kept":1054,"cut":false,"hidden":true,"merged":[]}
[{"$f":"D1&E1","v":"setdefault account="},null,null,"setdefault account=",null,null,{"$f":"'SD Control Sheet'!E9","v":"Sundry Debtors (BZ345)"},{"$f":"IF(G1=0,\"\",VLOOKUP(G1,'Tables (2)'!E:F,2,FALSE))","v":"BZ345"}]
["setdefault amount=",null,null,"setdefault amount=",null,null,{"$f":"'SD Control Sheet'!E10","v":"Corporate Balance Sheet (90000)"},{"$f":"IF(G2=0,\"\",VLOOKUP(G2,'Tables (2)'!G:H,2,FALSE))","v":90000}]
["setdefault client=WBC",null,null,"setdefault client=","WBC",null,{"$f":"'SD Control Sheet'!E11","v":"Children's Services (99999-104)"},{"$f":"IF(G3=0,\"\",VLOOKUP(G3,'Tables (2)'!I:J,2,FALSE))","v":"99999-104"}]
["setdefault cur_amount=",null,null,"setdefault cur_amount=",null,null,{"$f":"'SD Control Sheet'!E12","v":"Revenue (REV01)"},{"$f":"IF(G4=0,\"\",VLOOKUP(G4,'Tables (2)'!K:L,2,FALSE))","v":"REV01"}]
["setdefault currency=GBP",null,null,"setdefault currency=","GBP",null,{"$f":"'SD Control Sheet'!E13","v":0},{"$f":"IF(G5=0,\"\",VLOOKUP(G5,'Tables (2)'!M:N,2,FALSE))","v":""}]
["setdefault description=",null,null,"setdefault description=",null,null,{"$f":"'SD Control Sheet'!E14","v":0},{"$f":"IF(G6=0,\"\",VLOOKUP(G6,'Tables (2)'!O:P,2,FALSE))","v":""}]
["setdefault variant_number=99",null,null,"setdefault variant_number=",99,null,{"$f":"'SD Control Sheet'!E7","v":"2454-06-15"},{"$f":"'SD Control Sheet'!$E$7","v":202512}]
["setdefault dim_1=C1",null,null,"setdefault dim_1=",{"$f":"VLOOKUP('SD Control Sheet'!E20,'Tables (2)'!S:T,2,FALSE)","v":"C1"},null,{"$f":"'SD Control Sheet'!E8","v":"2454-09-12"},{"$f":"'SD Control Sheet'!$E$8","v":202601}]
["setdefault dim_2=B0",null,null,"setdefault dim_2=",{"$f":"VLOOKUP('SD Control Sheet'!E21,'Tables (2)'!S:T,2,FALSE)","v":"B0"}]
["setdefault dim_3=C0",null,null,"setdefault dim_3=",{"$f":"VLOOKUP('SD Control Sheet'!E22,'Tables (2)'!S:T,2,FALSE)","v":"C0"}]
{"$rows_left_out":1045}
{"sheet":"Tables (2)","index":11,"n_rows":123,"n_cols":32,"rows_kept":123,"cut":false,"hidden":true,"merged":[]}
[]
[null,"Month","Period",null,"Description","Account","Description","CostC","Description","Analysis4","Description","Analysis3","Description","Analysis2","Description","Analysis",null,null,"Name","ID",null,null,"Description","Analysis3","Description","Analysis3","Len","Type","Description","Cat","Mnt","S"]
[null,"Please select","Please select",null,"Sundry Debtors (BZ345)","BZ345","Corporate Balance Sheet (90000)",90000,"Please select",null,{"$f":"IF(IF('SD Control Sheet'!$E$9=\"Receipts in Advance (BZ547)\",'Tables (2)'!Y3,'Tables (2)'!W3)=0,\"\",IF('SD Control Sheet'!$E$9=\"Receipts in Advance (BZ547)\",'Tables (2)'!Y3,'Tables (2)'!W3))","v":"Capital (CAP01)"},"CAP01","NNDR (Z7001)","Z7001","Prior Year Adjustments (Z9001)","Z9001",null,null,"text att_name","text attribute_id",null,null,"Capital (CAP01)","CAP01","Capital (CAP01)","CAP01","text data_length","text data_type","text description","text dim_position","text maintenance","text status"]
[null,"2015-03-01",201412,null,null,null,"Farley Hill Balance Sheet (91111)",91111,"Chief Executives Office (99999-101)","99999-101",{"$f":"IF(IF('SD Control Sheet'!$E$9=\"Receipts in Advance (BZ547)\",'Tables (2)'!Y4,'Tables (2)'!W4)=0,\"\",IF('SD Control Sheet'!$E$9=\"Receipts in Advance (BZ547)\",'Tables (2)'!Y4,'Tables (2)'!W4))","v":"Revenue (REV01)"},"REV01","Summons Costs (Z7002)","Z7002","PFI Finance Lease Payment (Z9002)","Z9002",null,null,null,"Position 0",null,null,"Revenue (REV01)","REV01","Revenue (REV01)","REV01"]
[null,"Adj-15",201413,null,null,null,"The Holt Balance Sheet (91204)",91204,"Adult Services (99999-103)","99999-103",{"$f":"IF(IF('SD Control Sheet'!$E$9=\"Receipts in Advance (BZ547)\",'Tables (2)'!Y5,'Tables (2)'!W5)=0,\"\",IF('SD Control Sheet'!$E$9=\"Receipts in Advance (BZ547)\",'Tables (2)'!Y5,'Tables (2)'!W5))","v":""},null,"Carters Hill Park (Z7101)","Z7101","Payments in Year (Z9003)","Z9003",null,"ACCOUNT","ACCOUNT","A0",null,null,null,null,"Housing GF Accounts 2003/04 (Y9001)","Y9001",8,"A","Account",0,"A","N"]
[null,"2015-04-01",201501,null,null,null,"Waingels Copse Balance Sheet (91209)",91209,"Children's Services (99999-104)","99999-104",{"$f":"IF(IF('SD Control Sheet'!$E$9=\"Receipts in Advance (BZ547)\",'Tables (2)'!Y6,'Tables (2)'!W6)=0,\"\",IF('SD Control Sheet'!$E$9=\"Receipts in Advance (BZ547)\",'Tables (2)'!Y6,'Tables (2)'!W6))","v":""},null,"Twyford Orchards (Z7102)","Z7102","Interest Paid on Balances (Z9004)","Z9004",null,null,null,"Category 1",null,null,null,null,"Housing GF Accounts 2008/09 (Y9002)","Y9002"]
[null,"2015-05-01",201502,null,null,null,"HRA Balance Sheet (93500)",93500,"Place & Growth (99999-105)","99999-105",{"$f":"IF(IF('SD Control Sheet'!$E$9=\"Receipts in Advance (BZ547)\",'Tables (2)'!Y7,'Tables (2)'!W7)=0,\"\",IF('SD Control Sheet'!$E$9=\"Receipts in Advance (BZ547)\",'Tables (2)'!Y7,'Tables (2)'!W7))","v":""},null,"Grovelands (Z7201)","Z7201","Precepts Paid (Z9005)","Z9005",null,"CAT1","COSTC","C1",null,null,null,null,"Housing GF Accounts 2009/10 (Y9003)","Y9003",8,"A","Cost centre (CC)",1,"M","N"]
[null,"2015-06-01",201503,null,null,null,null,null,"Resources & Assets (99999-106)","99999-106",{"$f":"IF(IF('SD Control Sheet'!$E$9=\"Receipts in Advance (BZ547)\",'Tables (2)'!Y8,'Tables (2)'!W8)=0,\"\",IF('SD Control Sheet'!$E$9=\"Receipts in Advance (BZ547)\",'Tables (2)'!Y8,'Tables (2)'!W8))","v":""},null,"California Homeless (Z7202)","Z7202","DR Transfer to Services (Z9006)","Z9006",null,null,null,"Category 2",null,null,null,null,"Housing GF Accounts 2010/11 (Y9004)","Y9004"]
[null,"2015-07-01",201504,null,null,null,null,null,"Housing General Fund (99999-110)","99999-110",{"$f":"IF(IF('SD Control Sheet'!$E$9=\"Receipts in Advance (BZ547)\",'Tables (2)'!Y9,'Tables (2)'!W9)=0,\"\",IF('SD Control Sheet'!$E$9=\"Receipts in Advance (BZ547)\",'Tables (2)'!Y9,'Tables (2)'!W9))","v":""},null,"Oxford Road (Z7203)","Z7203","Service Charge (Z9007)","Z9007",null,"CAT2","PROJECT","B0",null,null,null,null,"Housing GF Accounts 2011/12 (Y9005)","Y9005",8,"A","Project code",2,"M","N"]
[null,"2015-08-01",201505,null,null,null,null,null,"Housing Revenue Account (99999-111)","99999-111",{"$f":"IF(IF('SD Control Sheet'!$E$9=\"Receipts in Advance (BZ547)\",'Tables (2)'!Y10,'Tables (2)'!W10)=0,\"\",IF('SD Control Sheet'!$E$9=\"Receipts in Advance (BZ547)\",'Tables (2)'!Y10,'Tables (2)'!W10))","v":""},null,"Shared Owernership (Z7204)","Z7204","IAS 19 - Pension Costs (Z9008)","Z9008",null,null,null,"Category 3",null,null,null,null,"Housing GF Accounts 2012/13 (Y9006)","Y9006"]
{"$rows_left_out":114}
{"sheet":"Dates_Pmts_Info","index":12,"n_rows":23,"n_cols":19,"rows_kept":23,"cut":false,"hidden":true,"merged":[[0,14,0,18],[1,14,2,14],[1,16,2,16],[1,18,2,18],[1,17,2,17]]}
["Current Year (Start Date)","Current Year (End Date)","Current FY Year","Previous Year (Start Date)","Previous Year (End Date)","Previous FY Year","Previous Year June/July payment","Current Year June/July payment","Deadline:","End of Year Date:","Start of Year Date:","Accrual Period","Reversing Period",null,"School Details"]
[2025,2026,"2025-26",2024,2025,"2024-25",2.58,2.61,"FRIDAY, 20TH MARCH 2026","2026-03-31","1st April 2026",202512,202601,null,"URN","School Name","Cost Centre","LAEst","LA"]
[null,null,null,null,null,null,null,null,null,null,null,null,null,null,null,"Please select from the list"]
[null,null,null,null,null,null,null,null,null,null,null,null,null,null,109829,"Farley Hill Primary School",41111,8722088,872]
["2024-2025 funding guidance from DfE",null,null,null,null,null,"2025-2026 funding guidance from DfE",null,null,null,null,null,null,null,109830,"Lambs Lane Primary School",41122,8722089,872]
[null,null,null,null,null,null,null,null,null,null,null,null,null,null,109836,"Bearwood Primary School",41103,8722100,872]
[null,null,null,null,null,null,null,null,null,null,null,null,null,null,109850,"Aldryngton Primary School",41101,8722116,872]
[null,null,null,null,null,null,null,null,null,null,null,null,null,null,109869,"Walter Infant School",41144,8722137,872]
[null,null,null,null,null,null,null,null,null,null,null,null,null,null,109876,"Winnersh Primary School",41151,8722146,872]
[null,null,null,null,null,null,null,null,null,null,null,null,null,null,109878,"The Colleton Primary School",41105,8722149,872]
{"$rows_left_out":13}